leaf-n
type: LexicalEntry
canonical form: leaf
sense: 03657552-n
part of speech: noun

03657552-n
type: LexicalConcept
in scheme: en-word.net
definition: hinged or detachable flat section (as of a table or door)
ili: i55600
lexfile: noun.artifact
part of speech: noun
hypernym: 04172050-n