lane-n
type: LexicalEntry
canonical form: lane
sense: 03645974-n
part of speech: noun

03645974-n
type: LexicalConcept
in scheme: en-word.net
definition: a well-defined track or path; for e.g. swimmers or lines of traffic
ili: i55526
lexfile: noun.artifact
part of speech: noun
hypernym: 03905025-n