kite-n
type: LexicalEntry
canonical form: kite
sense: 03626682-n
part of speech: noun

03626682-n
type: LexicalConcept
in scheme: en-word.net
definition: plaything consisting of a light frame covered with tissue paper; flown in wind at end of a string
ili: i55407
lexfile: noun.artifact
part of speech: noun
hypernym: 03971038-n
mero part: 03627035-n