jack-n
type: LexicalEntry
canonical form: jack
sense: 03594700-n
part of speech: noun

03594700-n
type: LexicalConcept
in scheme: en-word.net
definition: an electrical device consisting of a connector socket designed for the insertion of a plug
ili: i55211
lexfile: noun.artifact
part of speech: noun
hypernym: 03274312-n