item-n
type: LexicalEntry
canonical form: item
sense: 03593583-n
part of speech: noun

03593583-n
type: LexicalConcept
in scheme: en-word.net
definition: a whole individual unit; especially when included in a list or collection
example: they reduced the price on many items
ili: i55204
lexfile: noun.artifact
part of speech: noun
hypernym: 00003553-n