interchange-n
type: LexicalEntry
canonical form: interchange
sense: 03582987-n
part of speech: noun

03582987-n
type: LexicalConcept
in scheme: en-word.net
definition: a junction of highways on different levels that permits traffic to move from one to another without crossing traffic streams
ili: i55142
lexfile: noun.artifact
part of speech: noun
hypernym: 03610935-n