house-n
type: LexicalEntry
canonical form: house
sense: 03549540-n
part of speech: noun

03549540-n
type: LexicalConcept
in scheme: en-word.net
definition: a dwelling that serves as living quarters for one or more families
example: he has a house on Cape Cod
example: she felt she had to get out of the house
ili: i54960
lexfile: noun.artifact
part of speech: noun
hypernym: 03264208-n
hypernym: 02916498-n
mero part: 03666235-n
mero part: 03691456-n
mero part: 03990739-n
mero part: 04352106-n