hotel-n
type: LexicalEntry
canonical form: hotel
sense: 03547513-n
part of speech: noun

03547513-n
type: LexicalConcept
in scheme: en-word.net
definition: a building where travelers can pay for lodging and meals and other services
ili: i54946
lexfile: noun.artifact
part of speech: noun
hypernym: 02916498-n
mero part: 03548040-n