horn-n
type: LexicalEntry
canonical form: horn
sense: 03542265-n
part of speech: noun

03542265-n
type: LexicalConcept
in scheme: en-word.net
definition: a noisemaker (as at parties or games) that makes a loud noise when you blow through it
ili: i54912
lexfile: noun.artifact
part of speech: noun
domain topic: 00456623-n
hypernym: 03833076-n