hookup-n
type: LexicalEntry
canonical form: hookup
sense: 03538666-n
part of speech: noun

assemblage-n
type: LexicalEntry
canonical form: assemblage
sense: 03538666-n
part of speech: noun

03538666-n
type: LexicalConcept
in scheme: en-word.net
definition: a system of components assembled together for a particular purpose
ili: i54890
lexfile: noun.artifact
part of speech: noun
hypernym: 04384144-n