heel-n
type: LexicalEntry
canonical form: heel
sense: 03516930-n
part of speech: noun

03516930-n
type: LexicalConcept
in scheme: en-word.net
definition: (golf) the part of the clubhead where it joins the shaft
ili: i54760
lexfile: noun.artifact
part of speech: noun
domain topic: 00465962-n
hypernym: 03898588-n