heel-n
type: LexicalEntry
canonical form: heel
sense: 03516570-n
part of speech: noun

03516570-n
type: LexicalConcept
in scheme: en-word.net
definition: the bottom of a shoe or boot; the back part of a shoe or boot that touches the ground and provides elevation
ili: i54759
lexfile: noun.artifact
part of speech: noun
hypernym: 08528313-n
mero part: 03669700-n
mero part: 92450348-n