header-n
type: LexicalEntry
canonical form: header
sense: 03508377-n
part of speech: noun

lintel-n
type: LexicalEntry
canonical form: lintel
sense: 03508377-n
part of speech: noun

03508377-n
type: LexicalConcept
in scheme: en-word.net
definition: horizontal beam used as a finishing piece over a door or window
ili: i54710
lexfile: noun.artifact
part of speech: noun
hypernym: 02819085-n