haven-n
type: LexicalEntry
canonical form: haven
sense: 03504940-n
part of speech: noun

oasis-n
type: LexicalEntry
canonical form: oasis
sense: 03504940-n
part of speech: noun

03504940-n
type: LexicalConcept
in scheme: en-word.net
definition: a shelter serving as a place of safety or sanctuary
ili: i54686
lexfile: noun.artifact
part of speech: noun
hypernym: 04198638-n