hack-n
type: LexicalEntry
canonical form: hack
sense: 03479590-n
part of speech: noun

03479590-n
type: LexicalConcept
in scheme: en-word.net
definition: a tool (as a hoe or pick or mattock) used for breaking up the surface of the soil
ili: i54538
lexfile: noun.artifact
part of speech: noun
hypernym: 04459089-n