habit-n
type: LexicalEntry
canonical form: habit
sense: 03479089-n
part of speech: noun

03479089-n
type: LexicalConcept
in scheme: en-word.net
definition: a distinctive attire worn by a member of a religious order
ili: i54535
lexfile: noun.artifact
part of speech: noun
domain topic: 05955536-n
hypernym: 02759103-n