guide-n
type: LexicalEntry
canonical form: guide
sense: 03470959-n
part of speech: noun

03470959-n
type: LexicalConcept
in scheme: en-word.net
definition: a structure or marking that serves to direct the motion or positioning of something
ili: i54486
lexfile: noun.artifact
part of speech: noun
hypernym: 04348764-n