ground-n
type: LexicalEntry
canonical form: ground
sense: 03467526-n
part of speech: noun

03467526-n
type: LexicalConcept
in scheme: en-word.net
definition: (art) the surface (as a wall or canvas) prepared to take the paint for a painting
ili: i54463
lexfile: noun.artifact
part of speech: noun
domain topic: 00935235-n
hypernym: 04369112-n