graphics-n
type: LexicalEntry
canonical form: graphics
sense: 03458929-n
part of speech: noun

03458929-n
type: LexicalConcept
in scheme: en-word.net
definition: the drawings and photographs in the layout of a book
ili: i54403
lexfile: noun.artifact
part of speech: noun
hypernym: 03458753-n