gore-n
type: LexicalEntry
canonical form: gore
sense: 03453197-n
part of speech: noun

panel-n
type: LexicalEntry
canonical form: panel
sense: 03453197-n
part of speech: noun

03453197-n
type: LexicalConcept
in scheme: en-word.net
definition: a piece of cloth that is generally triangular or tapering; used in making garments or umbrellas or sails
ili: i54365
lexfile: noun.artifact
part of speech: noun
hypernym: 03938946-n