globe-n
type: LexicalEntry
canonical form: globe
sense: 03445436-n
part of speech: noun

03445436-n
type: LexicalConcept
in scheme: en-word.net
definition: a sphere on which a map (especially of the earth) is represented
ili: i54315
lexfile: noun.artifact
part of speech: noun
hypernym: 04281649-n
hypernym: 03782816-n