garden-n
type: LexicalEntry
canonical form: garden
sense: 03422255-n
part of speech: noun

03422255-n
type: LexicalConcept
in scheme: en-word.net
definition: a plot of ground where plants are cultivated
ili: i54178
lexfile: noun.artifact
part of speech: noun
hypernym: 08692477-n