garbage-n
type: LexicalEntry
canonical form: garbage
sense: 03421810-n
part of speech: noun

03421810-n
type: LexicalConcept
in scheme: en-word.net
definition: a receptacle where waste can be discarded
example: she tossed the moldy bread into the garbage
ili: i54175
lexfile: noun.artifact
part of speech: noun
hypernym: 04068016-n