front-n
type: LexicalEntry
canonical form: front
sense: 03403382-n
part of speech: noun

03403382-n
type: LexicalConcept
in scheme: en-word.net
definition: the side that is seen or that goes first
ili: i54070
lexfile: noun.artifact
part of speech: noun
hypernym: 04220693-n