foothold-n
type: LexicalEntry
canonical form: foothold
sense: 03384835-n
part of speech: noun

footing-n
type: LexicalEntry
canonical form: footing
sense: 03384835-n
part of speech: noun

03384835-n
type: LexicalConcept
in scheme: en-word.net
definition: a place providing support for the foot in standing or climbing
ili: i53960
lexfile: noun.artifact
part of speech: noun
hypernym: 04366676-n