fixings-n
type: LexicalEntry
canonical form: fixings
sense: 03359196-n
part of speech: noun

trimmings-n
type: LexicalEntry
canonical form: trimmings
sense: 03359196-n
part of speech: noun

03359196-n
type: LexicalConcept
in scheme: en-word.net
definition: the accessories that normally accompany (something or some activity)
example: an elaborate formal dinner with all the fixings
example: he bought a Christmas tree and trimmings to decorate it
ili: i53793
lexfile: noun.artifact
part of speech: noun
exemplifies: 06306016-n
hypernym: 02674051-n