finger-n
type: LexicalEntry
canonical form: finger
sense: 03346098-n
part of speech: noun

03346098-n
type: LexicalConcept
in scheme: en-word.net
definition: one of the parts of a glove that provides covering for a finger or thumb
ili: i53712
lexfile: noun.artifact
part of speech: noun
hypernym: 03127399-n