fashion-n
type: LexicalEntry
canonical form: fashion
sense: 03328538-n
part of speech: noun

03328538-n
type: LexicalConcept
in scheme: en-word.net
definition: consumer goods (especially clothing) in the current mode
ili: i53610
lexfile: noun.artifact
part of speech: noun
hypernym: 03098030-n