fag end-n
type: LexicalEntry
canonical form: fag end
sense: 03322081-n
part of speech: noun

03322081-n
type: LexicalConcept
in scheme: en-word.net
definition: the frayed end of a length of cloth or rope
ili: i53567
lexfile: noun.artifact
part of speech: noun
hypernym: 03291294-n