establishment-n
type: LexicalEntry
canonical form: establishment
sense: 03302664-n
part of speech: noun

03302664-n
type: LexicalConcept
in scheme: en-word.net
definition: a public or private structure (business or governmental or educational) including buildings and equipment for business or residence
ili: i53478
lexfile: noun.artifact
part of speech: noun
domain topic: 01096649-n
hypernym: 04348764-n