electrical system-n
type: LexicalEntry
canonical form: electrical system
sense: 03275076-n
part of speech: noun

03275076-n
type: LexicalConcept
in scheme: en-word.net
definition: equipment in a motor vehicle that provides electricity to start the engine and ignite the fuel and operate the lights and windshield wiper and heater and air conditioner and radio
ili: i53331
lexfile: noun.artifact
part of speech: noun
hypernym: 03298959-n
mero part: 02702923-n
mero part: 02964661-n
mero part: 03509141-n
mero part: 03565747-n
mero part: 04311513-n
mero part: 04391997-n
mero part: 04547683-n
mero part: 07277372-n