dumbbell-n
type: LexicalEntry
canonical form: dumbbell
sense: 03259733-n
part of speech: noun

03259733-n
type: LexicalConcept
in scheme: en-word.net
definition: an exercising weight; two spheres connected by a short bar that serves as a handle
ili: i53245
lexfile: noun.artifact
part of speech: noun
hypernym: 04578578-n