dubbing-n
type: LexicalEntry
canonical form: dubbing
sense: 03257662-n
part of speech: noun

03257662-n
type: LexicalConcept
in scheme: en-word.net
definition: a new soundtrack that is added to a film
ili: i53229
lexfile: noun.artifact
part of speech: noun
hypernym: 04270079-n