drug-n
type: LexicalEntry
canonical form: drug
sense: 03252323-n
part of speech: noun

03252323-n
type: LexicalConcept
in scheme: en-word.net
definition: a substance that is used as a medicine or narcotic
ili: i53204
lexfile: noun.artifact
part of speech: noun
hypernym: 14802595-n