draw-n
type: LexicalEntry
canonical form: draw
sense: 03237949-n
part of speech: noun

03237949-n
type: LexicalConcept
in scheme: en-word.net
definition: a playing card or cards dealt or taken from the pack
example: he got a pair of kings in the draw
ili: i53122
lexfile: noun.artifact
part of speech: noun
hypernym: 03970276-n