design-n
type: LexicalEntry
canonical form: design
sense: 03183984-n
part of speech: noun

03183984-n
type: LexicalConcept
in scheme: en-word.net
definition: a preliminary sketch indicating the plan for something
example: the design of a building
ili: i52809
lexfile: noun.artifact
part of speech: noun
hypernym: 04234206-n