cupboard-n
type: LexicalEntry
canonical form: cupboard
sense: 03152990-n
part of speech: noun

closet-n
type: LexicalEntry
canonical form: closet
sense: 03152990-n
part of speech: noun

03152990-n
type: LexicalConcept
in scheme: en-word.net
definition: a small room (or recess) or cabinet used for storage space
ili: i52616
lexfile: noun.artifact
part of speech: noun
hypernym: 04336084-n