cup-n
type: LexicalEntry
canonical form: cup
sense: 03152567-n
part of speech: noun

loving cup-n
type: LexicalEntry
canonical form: loving cup
sense: 03152567-n
part of speech: noun

03152567-n
type: LexicalConcept
in scheme: en-word.net
definition: a large metal vessel with two handles that is awarded as a trophy to the winner of a competition
example: the school kept the cups in a special glass case
ili: i52614
lexfile: noun.artifact
part of speech: noun
hypernym: 04495252-n