covering-n
type: LexicalEntry
canonical form: covering
sense: 03127399-n
part of speech: noun

03127399-n
type: LexicalConcept
in scheme: en-word.net
definition: an artifact that covers something else (usually to protect or shelter or conceal it)
ili: i52450
lexfile: noun.artifact
part of speech: noun
hypernym: 00022119-n