court-n
type: LexicalEntry
canonical form: court
sense: 03125142-n
part of speech: noun

03125142-n
type: LexicalConcept
in scheme: en-word.net
definition: a specially marked horizontal area within which a game is played
example: players had to reserve a court in advance
ili: i52437
lexfile: noun.artifact
part of speech: noun
hypernym: 08588287-n