counter-n
type: LexicalEntry
canonical form: counter
sense: 03121850-n
part of speech: noun

03121850-n
type: LexicalConcept
in scheme: en-word.net
definition: game equipment (as a piece of wood, plastic, or ivory) used for keeping a count or reserving a space in various card or board games
ili: i52420
lexfile: noun.artifact
part of speech: noun
hypernym: 03419072-n