cotton gin-n
type: LexicalEntry
canonical form: cotton gin
sense: 03120176-n
part of speech: noun

gin-n
type: LexicalEntry
canonical form: gin
sense: 03120176-n
part of speech: noun

03120176-n
type: LexicalConcept
in scheme: en-word.net
definition: a machine that separates the seeds from raw cotton fibers
ili: i52409
lexfile: noun.artifact
part of speech: noun
hypernym: 03705309-n