corner-n
type: LexicalEntry
canonical form: corner
sense: 03114532-n
part of speech: noun

nook-n
type: LexicalEntry
canonical form: nook
sense: 03114532-n
part of speech: noun

03114532-n
type: LexicalConcept
in scheme: en-word.net
definition: an interior angle formed by two meeting walls
example: a piano was in one corner of the room
ili: i52372
lexfile: noun.artifact
part of speech: noun
hypernym: 02738693-n