composition-n
type: LexicalEntry
canonical form: composition
sense: 03085664-n
part of speech: noun

03085664-n
type: LexicalConcept
in scheme: en-word.net
definition: something that is created by arranging several things to form a unified whole
example: he envied the composition of their faculty
ili: i52229
lexfile: noun.artifact
part of speech: noun
hypernym: 03133774-n