combine-n
type: LexicalEntry
canonical form: combine
sense: 03079638-n
part of speech: noun

03079638-n
type: LexicalConcept
in scheme: en-word.net
definition: harvester that heads and threshes and cleans grain while moving across the field
ili: i52199
lexfile: noun.artifact
part of speech: noun
hypernym: 03502017-n