cocaine-n
type: LexicalEntry
canonical form: cocaine
sense: 03064297-n
part of speech: noun

cocain-n
type: LexicalEntry
canonical form: cocain
sense: 03064297-n
part of speech: noun

03064297-n
type: LexicalConcept
in scheme: en-word.net
definition: a narcotic (alkaloid) extracted from coca leaves; used as a surface anesthetic or taken for pleasure; can become powerfully addictive
ili: i52104
lexfile: noun.artifact
part of speech: noun
hypernym: 03497818-n