clip-n
type: LexicalEntry
canonical form: clip
sense: 03047943-n
part of speech: noun

03047943-n
type: LexicalConcept
in scheme: en-word.net
definition: any of various small fasteners used to hold loose articles together
ili: i52009
lexfile: noun.artifact
part of speech: noun
hypernym: 03328648-n