clapper-n
type: LexicalEntry
canonical form: clapper
sense: 03041213-n
part of speech: noun

tongue-n
type: LexicalEntry
canonical form: tongue
sense: 03041213-n
part of speech: noun

03041213-n
type: LexicalConcept
in scheme: en-word.net
definition: metal striker that hangs inside a bell and makes a sound by hitting the side
ili: i51966
lexfile: noun.artifact
part of speech: noun
hypernym: 04344878-n