chopine-n
type: LexicalEntry
canonical form: chopine
sense: 03028933-n
part of speech: noun

platform-n
type: LexicalEntry
canonical form: platform
sense: 03028933-n
part of speech: noun

03028933-n
type: LexicalConcept
in scheme: en-word.net
definition: a woman's shoe with a very high thick sole
ili: i51895
lexfile: noun.artifact
part of speech: noun
hypernym: 04206070-n