chart-n
type: LexicalEntry
canonical form: chart
sense: 03013574-n
part of speech: noun

03013574-n
type: LexicalConcept
in scheme: en-word.net
definition: a map designed to assist navigation by air or sea
ili: i51796
lexfile: noun.artifact
part of speech: noun
hypernym: 03725654-n